null
SMILES: Cc1cc(O)c2C(=O)C=C(C(=O)c2c1)c1c(C)cc2C(=O)C=CC(=O)c2c1O
InChI Key: InChIKey=WRFTYMHHWSAKSK-UHFFFAOYSA-N
Activity Spreadsheet -- Enzyme Inhibition Constant Data from BindingDB
Found 1 hit for monomerid = 93038
Trg + Lig
Ki
nM
ΔG°
kcal/mole
IC50
nM
Kd
nM
EC50/IC50
nM
koff
s-1
kon
M-1s-1
pHTemp
°C
DNA gyrase subunit A
(Mycobacterium tuberculosis (strain ATCC 25618 / H3...)
BDBM93038
(Diospyrin)
Show SMILES Cc1cc(O)c2C(=O)C=C(C(=O)c2c1)c1c(C)cc2C(=O)C=CC(=O)c2c1O |c:8,23|
Show InChI InChI=1S/C22H14O6/c1-9-5-12-19(16(25)6-9)17(26)8-13(21(12)27)18-10(2)7-11-14(23)3-4-15(24)20(11)22(18)28/h3-8,25,28H,1-2H3
n/an/a 1.50E+4n/an/an/an/an/an/a
John Innes Centre
Assay Description
Mycobacterium tuberculosis gyrase supercoiling, relaxation, and decatenation assays were carried out as described previously.
J Biol Chem 288: 5149-56 (2013)
Article DOI: 10.1074/jbc.M112.419069
BindingDB Entry DOI: 10.7270/Q2V69H6R