BDBM93056 TLM analog, 13
SMILES: C\C(C=C)=C/[C@@]1(C)SC(=O)C(CCc2ccc(C)cc2)C1=O
InChI Key: InChIKey=KHDAKOYCGCOQIF-COTHKEICSA-N
Data: 1 KI  1 Kd
Activity Spreadsheet -- Enzyme Inhibition Constant Data from BindingDB
Found 2 hits for monomerid = 93056
Trg + Lig
Ki
nM
ΔG°
kcal/mole
IC50
nM
Kd
nM
EC50/IC50
nM
koff
s-1
kon
M-1s-1
pHTemp
°C
Beta-ketoacyl-ACP synthase (KasA) C171Q
(Mycobacterium tuberculosis)
BDBM93056
(TLM analog, 13)
Show SMILES C\C(C=C)=C/[C@@]1(C)SC(=O)C(CCc2ccc(C)cc2)C1=O |r|
Show InChI InChI=1S/C19H22O2S/c1-5-13(2)12-19(4)17(20)16(18(21)22-19)11-10-15-8-6-14(3)7-9-15/h5-9,12,16H,1,10-11H2,2-4H3/b13-12+/t16?,19-/m1/s1
9.28E+4n/an/an/an/an/an/a8.5n/a
Institute for Chemical Biology & Drug Discovery
Assay Description
Binding of TLM and the TLM analogs to KasA was quantified by monitoring changes in the intrinsic tryptophan fluroescence of the enzyme using 280-nm e...
J Biol Chem 288: 6045-52 (2013)
Article DOI: 10.1074/jbc.M112.414516
BindingDB Entry DOI: 10.7270/Q2KP80S4
Beta-ketoacyl-ACP synthase (KasA)
(Mycobacterium tuberculosis)
BDBM93056
(TLM analog, 13)
Show SMILES C\C(C=C)=C/[C@@]1(C)SC(=O)C(CCc2ccc(C)cc2)C1=O |r|
Show InChI InChI=1S/C19H22O2S/c1-5-13(2)12-19(4)17(20)16(18(21)22-19)11-10-15-8-6-14(3)7-9-15/h5-9,12,16H,1,10-11H2,2-4H3/b13-12+/t16?,19-/m1/s1
n/an/an/a 1.50E+5n/an/an/a8.5n/a
Institute for Chemical Biology & Drug Discovery
Assay Description
Binding of TLM and the TLM analogs to KasA was quantified by monitoring changes in the intrinsic tryptophan fluroescence of the enzyme using 280-nm e...
J Biol Chem 288: 6045-52 (2013)
Article DOI: 10.1074/jbc.M112.414516
BindingDB Entry DOI: 10.7270/Q2KP80S4