BDBM93057 TLM analog, 14
SMILES: C\C(C=C)=C/[C@@]1(C)SC(=O)C(CCCCc2ccc(F)cc2)C1=O
InChI Key: InChIKey=JOPYNZZWZRBJJU-SUUVYPJQSA-N
Data: 1 KI  1 Kd
Activity Spreadsheet -- Enzyme Inhibition Constant Data from BindingDB
Found 2 hits for monomerid = 93057
Trg + Lig
Ki
nM
ΔG°
kcal/mole
IC50
nM
Kd
nM
EC50/IC50
nM
koff
s-1
kon
M-1s-1
pHTemp
°C
Beta-ketoacyl-ACP synthase (KasA) C171Q
(Mycobacterium tuberculosis)
BDBM93057
(TLM analog, 14)
Show SMILES C\C(C=C)=C/[C@@]1(C)SC(=O)C(CCCCc2ccc(F)cc2)C1=O |r|
Show InChI InChI=1S/C20H23FO2S/c1-4-14(2)13-20(3)18(22)17(19(23)24-20)8-6-5-7-15-9-11-16(21)12-10-15/h4,9-13,17H,1,5-8H2,2-3H3/b14-13+/t17?,20-/m1/s1
6.90E+4n/an/an/an/an/an/a8.5n/a
Institute for Chemical Biology & Drug Discovery
Assay Description
Binding of TLM and the TLM analogs to KasA was quantified by monitoring changes in the intrinsic tryptophan fluroescence of the enzyme using 280-nm e...
J Biol Chem 288: 6045-52 (2013)
Article DOI: 10.1074/jbc.M112.414516
BindingDB Entry DOI: 10.7270/Q2KP80S4
Beta-ketoacyl-ACP synthase (KasA)
(Mycobacterium tuberculosis)
BDBM93057
(TLM analog, 14)
Show SMILES C\C(C=C)=C/[C@@]1(C)SC(=O)C(CCCCc2ccc(F)cc2)C1=O |r|
Show InChI InChI=1S/C20H23FO2S/c1-4-14(2)13-20(3)18(22)17(19(23)24-20)8-6-5-7-15-9-11-16(21)12-10-15/h4,9-13,17H,1,5-8H2,2-3H3/b14-13+/t17?,20-/m1/s1
n/an/an/a 7.06E+4n/an/an/a8.5n/a
Institute for Chemical Biology & Drug Discovery
Assay Description
Binding of TLM and the TLM analogs to KasA was quantified by monitoring changes in the intrinsic tryptophan fluroescence of the enzyme using 280-nm e...
J Biol Chem 288: 6045-52 (2013)
Article DOI: 10.1074/jbc.M112.414516
BindingDB Entry DOI: 10.7270/Q2KP80S4