BDBM93110 PTP1B Inhibitor, 6
SMILES: COc1ccc(cc1)C1CC(=NO1)c1ccc2OC(C)(C)C=Cc2c1OC
InChI Key: InChIKey=LNLOREVTGJHTNX-UHFFFAOYSA-N
Data: 1 KI  1 IC50
Activity Spreadsheet -- Enzyme Inhibition Constant Data from BindingDB
Found 1 hit for monomerid = 93110
Trg + Lig
Ki
nM
ΔG°
kcal/mole
IC50
nM
Kd
nM
EC50/IC50
nM
koff
s-1
kon
M-1s-1
pHTemp
°C
Protein-tyrosine phosphatase 1B
(Homo sapiens (Human))
BDBM93110
(PTP1B Inhibitor, 6)
Show SMILES COc1ccc(cc1)C1CC(=NO1)c1ccc2OC(C)(C)C=Cc2c1OC |c:11,23|
Show InChI InChI=1S/C22H23NO4/c1-22(2)12-11-17-19(26-22)10-9-16(21(17)25-4)18-13-20(27-23-18)14-5-7-15(24-3)8-6-14/h5-12,20H,13H2,1-4H3
NCI pathway
Reactome pathway
5.60E+4n/a 9.10E+4n/an/an/an/a7.0n/a
Central Drug Research Institute,
Assay Description
The effect of the test compounds on PTP1B was studied by preincubating the test compound with enzyme in the reaction system for 10 min and determinin...
Medicinal Chemistry Research 17: 123-136 (2008)
BindingDB Entry DOI: 10.7270/Q2JQ0ZMG