BDBM93112 PTP1B Inhibitor, 10
SMILES: COc1cc(C=O)ccc1C1=NOC(C1)c1ccccc1
InChI Key: InChIKey=HSLNAPLEELADID-UHFFFAOYSA-N
Data: 1 KI  1 IC50
Activity Spreadsheet -- Enzyme Inhibition Constant Data from BindingDB
Found 1 hit for monomerid = 93112
Trg + Lig
Ki
nM
ΔG°
kcal/mole
IC50
nM
Kd
nM
EC50/IC50
nM
koff
s-1
kon
M-1s-1
pHTemp
°C
Protein-tyrosine phosphatase 1B
(Homo sapiens (Human))
BDBM93112
(PTP1B Inhibitor, 10)
Show SMILES COc1cc(C=O)ccc1C1=NOC(C1)c1ccccc1 |t:11|
Show InChI InChI=1S/C17H15NO3/c1-20-17-9-12(11-19)7-8-14(17)15-10-16(21-18-15)13-5-3-2-4-6-13/h2-9,11,16H,10H2,1H3
NCI pathway
Reactome pathway
4.80E+4n/a 6.90E+4n/an/an/an/a7.0n/a
Central Drug Research Institute,
Assay Description
The effect of the test compounds on PTP1B was studied by preincubating the test compound with enzyme in the reaction system for 10 min and determinin...
Medicinal Chemistry Research 17: 123-136 (2008)
BindingDB Entry DOI: 10.7270/Q2JQ0ZMG