BDBM93229 Kinase inhibitor, F3
SMILES: Fc1ccccc1-c1cc(=O)n2cc[nH]c2n1
InChI Key: InChIKey=DZACLEUXMQVOIW-UHFFFAOYSA-N
Data: 2 IC50
Activity Spreadsheet -- Enzyme Inhibition Constant Data from BindingDB
Found 2 hits for monomerid = 93229
Trg + Lig
Ki
nM
ΔG°
kcal/mole
IC50
nM
Kd
nM
EC50/IC50
nM
koff
s-1
kon
M-1s-1
pHTemp
°C
Serine/threonine-protein kinase pim-3
(Homo sapiens (Human))
BDBM93229
(Kinase inhibitor, F3)
Show SMILES Fc1ccccc1-c1cc(=O)n2cc[nH]c2n1
Show InChI InChI=1S/C12H8FN3O/c13-9-4-2-1-3-8(9)10-7-11(17)16-6-5-14-12(16)15-10/h1-7H,(H,14,15)
n/an/a 1.40E+4n/an/an/an/an/an/a
University of Dundee
Assay Description
Selected compounds were screened against a panel of mammalian kinases. Compounds were supplied in DMSO and screened in duplicates at 100 uM concentr...
ACS Chem Biol 8: 1044-52 (2013)
Article DOI: 10.1021/cb300729y
BindingDB Entry DOI: 10.7270/Q2MG7N3W
Serine/threonine-protein kinase pim-1
(Homo sapiens (Human))
BDBM93229
(Kinase inhibitor, F3)
Show SMILES Fc1ccccc1-c1cc(=O)n2cc[nH]c2n1
Show InChI InChI=1S/C12H8FN3O/c13-9-4-2-1-3-8(9)10-7-11(17)16-6-5-14-12(16)15-10/h1-7H,(H,14,15)
n/an/a 2.20E+4n/an/an/an/an/an/a
University of Dundee
Assay Description
Selected compounds were screened against a panel of mammalian kinases. Compounds were supplied in DMSO and screened in duplicates at 100 uM concentr...
ACS Chem Biol 8: 1044-52 (2013)
Article DOI: 10.1021/cb300729y
BindingDB Entry DOI: 10.7270/Q2MG7N3W