BDBM93290 Oxamic Acid/Ester, 6
SMILES: COc1ccccc1NC(=O)C(O)=O
InChI Key: InChIKey=SZELSBIQGGTLAH-UHFFFAOYSA-N
Data: 2 IC50
Activity Spreadsheet -- Enzyme Inhibition Constant Data from BindingDB
Found 2 hits for monomerid = 93290
Trg + Lig
Ki
nM
ΔG°
kcal/mole
IC50
nM
Kd
nM
EC50/IC50
nM
koff
s-1
kon
M-1s-1
pHTemp
°C
Lactate dehydrogenase (LDH)
(Bos taurus (Bovine))
BDBM93290
(Oxamic Acid/Ester, 6)
Show SMILES COc1ccccc1NC(=O)C(O)=O
Show InChI InChI=1S/C9H9NO4/c1-14-7-5-3-2-4-6(7)10-8(11)9(12)13/h2-5H,1H3,(H,10,11)(H,12,13)
n/an/a>2.00E+5n/an/an/an/an/an/a
University of Mississippi
Assay Description
Enzyme assay using recombinant pfLDH and mLDH (bovine heart).
J Comb Chem 9: 292-300 (2007)
Article DOI: 10.1021/cc060110n
BindingDB Entry DOI: 10.7270/Q23J3BKZ
Lactate dehydrogenase (LDH)
(Plasmodium falciparum)
BDBM93290
(Oxamic Acid/Ester, 6)
Show SMILES COc1ccccc1NC(=O)C(O)=O
Show InChI InChI=1S/C9H9NO4/c1-14-7-5-3-2-4-6(7)10-8(11)9(12)13/h2-5H,1H3,(H,10,11)(H,12,13)
n/an/a>2.00E+5n/an/an/an/an/an/a
University of Mississippi
Assay Description
Enzyme assay using recombinant pfLDH and mLDH (bovine heart).
J Comb Chem 9: 292-300 (2007)
Article DOI: 10.1021/cc060110n
BindingDB Entry DOI: 10.7270/Q23J3BKZ