BDBM9390 CHEMBL55466::N-[2-(1-benzylpiperidin-4-yl)ethyl]-3-nitrobenzamide hydrochloride::Piperidine Derivative 3f
SMILES: [O-][N+](=O)c1cccc(c1)C(=O)NCCC1CCN(Cc2ccccc2)CC1
InChI Key: InChIKey=GLNGPQZIKMZVPM-UHFFFAOYSA-N
Data: 2 IC50
Activity Spreadsheet -- Enzyme Inhibition Constant Data from BindingDB
Found 2 hits for monomerid = 9390
Trg + Lig
Ki
nM
ΔG°
kcal/mole
IC50
nM
Kd
nM
EC50/IC50
nM
koff
s-1
kon
M-1s-1
pHTemp
°C
Acetylcholinesterase
(Mus musculus (mouse))
BDBM9390
(CHEMBL55466 | N-[2-(1-benzylpiperidin-4-yl)ethyl]-...)
Show SMILES [O-][N+](=O)c1cccc(c1)C(=O)NCCC1CCN(Cc2ccccc2)CC1
Show InChI InChI=1S/C21H25N3O3/c25-21(19-7-4-8-20(15-19)24(26)27)22-12-9-17-10-13-23(14-11-17)16-18-5-2-1-3-6-18/h1-8,15,17H,9-14,16H2,(H,22,25)
Reactome pathway
n/an/a 230n/an/an/an/an/an/a
University of Missouri-St. Louis
Curated by ChEMBL
Assay Description
Inhibition against Acetylcholinesterase (AChE)
J Med Chem 39: 380-7 (1996)
Article DOI: 10.1021/jm950704x
BindingDB Entry DOI: 10.7270/Q25D8T1Q
Acetylcholinesterase
(Mus musculus (mouse))
BDBM9390
(CHEMBL55466 | N-[2-(1-benzylpiperidin-4-yl)ethyl]-...)
Show SMILES [O-][N+](=O)c1cccc(c1)C(=O)NCCC1CCN(Cc2ccccc2)CC1
Show InChI InChI=1S/C21H25N3O3/c25-21(19-7-4-8-20(15-19)24(26)27)22-12-9-17-10-13-23(14-11-17)16-18-5-2-1-3-6-18/h1-8,15,17H,9-14,16H2,(H,22,25)
Reactome pathway
n/an/a 230n/an/an/an/a7.425
Tsukuba Research Laboratories
Assay Description
The cholinesterase assays were performed using colorimetric method reported by Ellman. The amount of a yellow substance formed after incubation was d...
J Med Chem 33: 1880-7 (1990)
Article DOI: 10.1021/jm00169a008
BindingDB Entry DOI: 10.7270/Q20Z71H2