BDBM95308 5-(3,4-dimethoxyphenyl)-2-(3,5-dimethoxyphenyl)-1-methyl-3-(phenylthio)indole::5-(3,4-dimethoxyphenyl)-2-(3,5-dimethoxyphenyl)-1-methyl-3-phenylsulfanyl-indole::5-(3,4-dimethoxyphenyl)-2-(3,5-dimethoxyphenyl)-1-methyl-3-phenylsulfanylindole::MLS003591614::SMR002252911::cid_53301431
SMILES: COc1cc(OC)cc(c1)-c1c(Sc2ccccc2)c2cc(ccc2n1C)-c1ccc(OC)c(OC)c1
InChI Key: InChIKey=XFCAZBGFMLWCFD-UHFFFAOYSA-N
Data: 3 IC50
Activity Spreadsheet -- Enzyme Inhibition Constant Data from BindingDB
Found 3 hits for monomerid = 95308
Trg + Lig
Ki
nM
ΔG°
kcal/mole
IC50
nM
Kd
nM
EC50/IC50
nM
koff
s-1
kon
M-1s-1
pHTemp
°C
HIV-1 B HXB2-LAI-IIIB-BRU
(Human immunodeficiency virus type 1 group M subtyp...)
BDBM95308
(5-(3,4-dimethoxyphenyl)-2-(3,5-dimethoxyphenyl)-1-...)
Show SMILES COc1cc(OC)cc(c1)-c1c(Sc2ccccc2)c2cc(ccc2n1C)-c1ccc(OC)c(OC)c1
Show InChI InChI=1S/C31H29NO4S/c1-32-27-13-11-20(21-12-14-28(35-4)29(18-21)36-5)17-26(27)31(37-25-9-7-6-8-10-25)30(32)22-15-23(33-2)19-24(16-22)34-3/h6-19H,1-5H3
PCBioAssay
n/an/a 3.96E+4n/an/an/an/an/an/a
The Scripps Research Institute Molecular Screening Center
Curated by PubChem BioAssay
PubChem Bioassay (2012)
BindingDB Entry DOI: 10.7270/Q2KD1WJB
HIV-1 B HXB2-LAI-IIIB-BRU
(Human immunodeficiency virus type 1 group M subtyp...)
BDBM95308
(5-(3,4-dimethoxyphenyl)-2-(3,5-dimethoxyphenyl)-1-...)
Show SMILES COc1cc(OC)cc(c1)-c1c(Sc2ccccc2)c2cc(ccc2n1C)-c1ccc(OC)c(OC)c1
Show InChI InChI=1S/C31H29NO4S/c1-32-27-13-11-20(21-12-14-28(35-4)29(18-21)36-5)17-26(27)31(37-25-9-7-6-8-10-25)30(32)22-15-23(33-2)19-24(16-22)34-3/h6-19H,1-5H3
PCBioAssay
n/an/a 1.13E+4n/an/an/an/an/an/a
The Scripps Research Institute Molecular Screening Center
Curated by PubChem BioAssay
PubChem Bioassay (2012)
BindingDB Entry DOI: 10.7270/Q29W0D3P
HIV-1 B HXB2-LAI-IIIB-BRU
(Human immunodeficiency virus type 1 group M subtyp...)
BDBM95308
(5-(3,4-dimethoxyphenyl)-2-(3,5-dimethoxyphenyl)-1-...)
Show SMILES COc1cc(OC)cc(c1)-c1c(Sc2ccccc2)c2cc(ccc2n1C)-c1ccc(OC)c(OC)c1
Show InChI InChI=1S/C31H29NO4S/c1-32-27-13-11-20(21-12-14-28(35-4)29(18-21)36-5)17-26(27)31(37-25-9-7-6-8-10-25)30(32)22-15-23(33-2)19-24(16-22)34-3/h6-19H,1-5H3
PCBioAssay
n/an/a 1.23E+4n/an/an/an/an/an/a
The Scripps Research Institute Molecular Screening Center
Curated by PubChem BioAssay
PubChem Bioassay (2012)
BindingDB Entry DOI: 10.7270/Q2FN14T0