BDBM95469 (2S)-2-[5-[[2-(2,4-dimethylanilino)-2-keto-ethyl]thio]-1,3,4-oxadiazol-2-yl]pyrrolidine-1-carboxylic acid tert-butyl ester::(2S)-2-[5-[[2-(2,4-dimethylanilino)-2-oxoethyl]thio]-1,3,4-oxadiazol-2-yl]-1-pyrrolidinecarboxylic acid tert-butyl ester::MLS000041693::SMR000046156::cid_665128::tert-butyl (2S)-2-[5-[2-(2,4-dimethylanilino)-2-oxoethyl]sulfanyl-1,3,4-oxadiazol-2-yl]pyrrolidine-1-carboxylate::tert-butyl (2S)-2-[5-[2-[(2,4-dimethylphenyl)amino]-2-oxidanylidene-ethyl]sulfanyl-1,3,4-oxadiazol-2-yl]pyrrolidine-1-carboxylate
SMILES: Cc1ccc(NC(=O)CSc2nnc(o2)[C@@H]2CCCN2C(=O)OC(C)(C)C)c(C)c1
InChI Key: InChIKey=CAUXBEUCVQKEPI-INIZCTEOSA-N
Data: 2 IC50
Activity Spreadsheet -- Enzyme Inhibition Constant Data from BindingDB
Found 2 hits for monomerid = 95469
Trg + Lig
Ki
nM
ΔG°
kcal/mole
IC50
nM
Kd
nM
EC50/IC50
nM
koff
s-1
kon
M-1s-1
pHTemp
°C
Alpha trans-inducing protein (VP16)
(Human herpesvirus 1 (strain 17) (HHV-1) (Human her...)
BDBM95469
((2S)-2-[5-[[2-(2,4-dimethylanilino)-2-keto-ethyl]t...)
Show SMILES Cc1ccc(NC(=O)CSc2nnc(o2)[C@@H]2CCCN2C(=O)OC(C)(C)C)c(C)c1
Show InChI InChI=1S/C21H28N4O4S/c1-13-8-9-15(14(2)11-13)22-17(26)12-30-19-24-23-18(28-19)16-7-6-10-25(16)20(27)29-21(3,4)5/h8-9,11,16H,6-7,10,12H2,1-5H3,(H,22,26)/t16-/m0/s1
PCBioAssay
n/an/a>3.59E+4n/an/an/an/an/an/a
The Scripps Research Institute Molecular Screening Center
Curated by PubChem BioAssay
PubChem Bioassay (2013)
BindingDB Entry DOI: 10.7270/Q2SX6BVP
nuclear receptor subfamily 5 group A member 2 isoform 2
(Homo sapiens (Human))
BDBM95469
((2S)-2-[5-[[2-(2,4-dimethylanilino)-2-keto-ethyl]t...)
Show SMILES Cc1ccc(NC(=O)CSc2nnc(o2)[C@@H]2CCCN2C(=O)OC(C)(C)C)c(C)c1
Show InChI InChI=1S/C21H28N4O4S/c1-13-8-9-15(14(2)11-13)22-17(26)12-30-19-24-23-18(28-19)16-7-6-10-25(16)20(27)29-21(3,4)5/h8-9,11,16H,6-7,10,12H2,1-5H3,(H,22,26)/t16-/m0/s1
Reactome pathway
PCBioAssay
n/an/a>1.33E+3n/an/an/an/an/an/a
The Scripps Research Institute Molecular Screening Center
Curated by PubChem BioAssay
PubChem Bioassay (2013)
BindingDB Entry DOI: 10.7270/Q22F7M18