BDBM96261 MLS000778391::N-(4-Methoxy-[1,2,5]thiadiazol-3-yl)-4-[3-(pyridine-4-carbonyl)-thioureido]-benzenesulfonamide::N-[[4-[(4-methoxy-1,2,5-thiadiazol-3-yl)sulfamoyl]anilino]-sulfanylidenemethyl]-4-pyridinecarboxamide::N-[[4-[(4-methoxy-1,2,5-thiadiazol-3-yl)sulfamoyl]phenyl]carbamothioyl]pyridine-4-carboxamide::N-[[4-[(4-methoxy-1,2,5-thiadiazol-3-yl)sulfamoyl]phenyl]thiocarbamoyl]isonicotinamide::SMR000415185::cid_1994988
SMILES: COc1nsnc1NS(=O)(=O)c1ccc(NC(=S)NC(=O)c2ccncc2)cc1
InChI Key: InChIKey=WDQMPWLUTRICDE-UHFFFAOYSA-N
Data: 1 IC50
Activity Spreadsheet -- Enzyme Inhibition Constant Data from BindingDB
Found 1 hit for monomerid = 96261
Trg + Lig
Ki
nM
ΔG°
kcal/mole
IC50
nM
Kd
nM
EC50/IC50
nM
koff
s-1
kon
M-1s-1
pHTemp
°C
exonuclease V (RecBCD complex), alpha chain
(Escherichia coli str. K-12 substr. MG1655)
BDBM96261
(MLS000778391 | N-(4-Methoxy-[1,2,5]thiadiazol-3-yl...)
Show SMILES COc1nsnc1NS(=O)(=O)c1ccc(NC(=S)NC(=O)c2ccncc2)cc1
Show InChI InChI=1S/C16H14N6O4S3/c1-26-15-13(20-28-21-15)22-29(24,25)12-4-2-11(3-5-12)18-16(27)19-14(23)10-6-8-17-9-7-10/h2-9H,1H3,(H,20,22)(H2,18,19,23,27)
PCBioAssay
n/an/a 1.46E+4n/an/an/an/an/an/a
The Scripps Research Institute Molecular Screening Center
Curated by PubChem BioAssay
PubChem Bioassay (2013)
BindingDB Entry DOI: 10.7270/Q21G0JXG