null
SMILES: CCC[C@H](NC(=O)[C@@H]1CC(C)(C)CN1C(=O)[C@@H](NC(=O)OCC(C)C)C(C)(C)C)C(=O)C(=O)NCC(=O)N[C@H](C(=O)N(C)C)c1ccccc1
InChI Key: InChIKey=YXZAOZSQAONLBB-SEGPTPNXSA-N
PDB links: 4 PDB IDs contain inhibitors having a similarity of 90% to this monomer.
Activity Spreadsheet -- Enzyme Inhibition Constant Data from BindingDB
Found 1 hit for monomerid = 9678
Trg + Lig
Ki
nM
ΔG°
kcal/mole
IC50
nM
Kd
nM
EC50/IC50
nM
koff
s-1
kon
M-1s-1
pHTemp
°C
Genome polyprotein
(Hepatitis C virus (HCV genotype 1a, isolate H))
BDBM9678
(2-methylpropyl N-[(2S)-1-[(2S)-2-{[(2S)-1-[({[(S)-...)
Show SMILES CCC[C@H](NC(=O)[C@@H]1CC(C)(C)CN1C(=O)[C@@H](NC(=O)OCC(C)C)C(C)(C)C)C(=O)C(=O)NCC(=O)N[C@H](C(=O)N(C)C)c1ccccc1 |r|
Show InChI InChI=1S/C36H56N6O8/c1-11-15-24(28(44)31(46)37-19-26(43)39-27(32(47)41(9)10)23-16-13-12-14-17-23)38-30(45)25-18-36(7,8)21-42(25)33(48)29(35(4,5)6)40-34(49)50-20-22(2)3/h12-14,16-17,22,24-25,27,29H,11,15,18-21H2,1-10H3,(H,37,46)(H,38,45)(H,39,43)(H,40,49)/t24-,25-,27-,29+/m0/s1
36 -10.3n/an/an/an/an/a6.530
Schering-Plough Research Institute
Assay Description
Proteolytic cleavage of the ester linkage between the Nva (L-norvaline) and the chromophore (PAP) was monitored for change in absorbance at 370 nm. I...
J Med Chem 49: 2750-7 (2006)
Article DOI: 10.1021/jm060077j
BindingDB Entry DOI: 10.7270/Q2V98691