BDBM97145 MLS001028746::N-[2-(2,5-dimethoxyphenyl)ethyl]-2-[3,4-dimethyl-2-(4-methylphenyl)-7-oxidanylidene-pyrazolo[3,4-d]pyridazin-6-yl]ethanamide::N-[2-(2,5-dimethoxyphenyl)ethyl]-2-[3,4-dimethyl-2-(4-methylphenyl)-7-oxo-6-pyrazolo[3,4-d]pyridazinyl]acetamide::N-[2-(2,5-dimethoxyphenyl)ethyl]-2-[3,4-dimethyl-2-(4-methylphenyl)-7-oxopyrazolo[3,4-d]pyridazin-6-yl]acetamide::N-[2-(2,5-dimethoxyphenyl)ethyl]-2-[7-keto-3,4-dimethyl-2-(p-tolyl)pyrazolo[3,4-d]pyridazin-6-yl]acetamide::SMR000629820::cid_20919845
SMILES: COc1ccc(OC)c(CCNC(=O)Cn2nc(C)c3c(C)n(nc3c2=O)-c2ccc(C)cc2)c1
InChI Key: InChIKey=KAGLRGADBKDSIQ-UHFFFAOYSA-N
Data: 3 IC50
Activity Spreadsheet -- Enzyme Inhibition Constant Data from BindingDB
Found 3 hits for monomerid = 97145
Trg + Lig
Ki
nM
ΔG°
kcal/mole
IC50
nM
Kd
nM
EC50/IC50
nM
koff
s-1
kon
M-1s-1
pHTemp
°C
COUP transcription factor 2
(Homo sapiens (Human))
BDBM97145
(MLS001028746 | N-[2-(2,5-dimethoxyphenyl)ethyl]-2-...)
Show SMILES COc1ccc(OC)c(CCNC(=O)Cn2nc(C)c3c(C)n(nc3c2=O)-c2ccc(C)cc2)c1
Show InChI InChI=1S/C26H29N5O4/c1-16-6-8-20(9-7-16)31-18(3)24-17(2)28-30(26(33)25(24)29-31)15-23(32)27-13-12-19-14-21(34-4)10-11-22(19)35-5/h6-11,14H,12-13,15H2,1-5H3,(H,27,32)
Reactome pathway
PCBioAssay
n/an/a 2.61E+3n/an/an/an/an/an/a
The Scripps Research Institute Molecular Screening Center
Curated by PubChem BioAssay
PubChem Bioassay (2013)
BindingDB Entry DOI: 10.7270/Q21Z431S
Tegument protein VP16
(Human herpesvirus 1 (strain 17) (HHV-1) (Human her...)
BDBM97145
(MLS001028746 | N-[2-(2,5-dimethoxyphenyl)ethyl]-2-...)
Show SMILES COc1ccc(OC)c(CCNC(=O)Cn2nc(C)c3c(C)n(nc3c2=O)-c2ccc(C)cc2)c1
Show InChI InChI=1S/C26H29N5O4/c1-16-6-8-20(9-7-16)31-18(3)24-17(2)28-30(26(33)25(24)29-31)15-23(32)27-13-12-19-14-21(34-4)10-11-22(19)35-5/h6-11,14H,12-13,15H2,1-5H3,(H,27,32)
PCBioAssay
n/an/a 2.85E+4n/an/an/an/an/an/a
The Scripps Research Institute Molecular Screening Center
Curated by PubChem BioAssay
Assay Description
Source (MLPCN Center Name): The Scripps Research Institute Molecular Screening Center Affiliation: The Scripps Research Institute, TSRI Assay Provide...
PubChem Bioassay (2013)
BindingDB Entry DOI: 10.7270/Q2GM85ZT
Galanin receptor type 3
(Homo sapiens (Human))
BDBM97145
(MLS001028746 | N-[2-(2,5-dimethoxyphenyl)ethyl]-2-...)
Show SMILES COc1ccc(OC)c(CCNC(=O)Cn2nc(C)c3c(C)n(nc3c2=O)-c2ccc(C)cc2)c1
Show InChI InChI=1S/C26H29N5O4/c1-16-6-8-20(9-7-16)31-18(3)24-17(2)28-30(26(33)25(24)29-31)15-23(32)27-13-12-19-14-21(34-4)10-11-22(19)35-5/h6-11,14H,12-13,15H2,1-5H3,(H,27,32)
Reactome pathway
PCBioAssay
n/an/a 2.76E+3n/an/an/an/an/an/a
The Scripps Research Institute Molecular Screening Center
Curated by PubChem BioAssay
PubChem Bioassay (2013)
BindingDB Entry DOI: 10.7270/Q270802Q