BDBM97434 100873, 18::BPH-1375
SMILES: NC(=O)c1cc(NC(=O)c2ccc(cc2)C(=O)Nc2cc(cc(c2)C2=NCCN2)C(N)=O)cc(c1)C1=NCCN1
InChI Key: InChIKey=FNXIZGCMHLSQBQ-UHFFFAOYSA-N
Data: 2 IC50
Activity Spreadsheet -- Enzyme Inhibition Constant Data from BindingDB
Found 2 hits for monomerid = 97434
Trg + Lig
Ki
nM
ΔG°
kcal/mole
IC50
nM
Kd
nM
EC50/IC50
nM
koff
s-1
kon
M-1s-1
pHTemp
°C
cis-Decaprenyl diphosphate synthase (cis-DPPS)
(Mycobacterium tuberculosis H37Rv)
BDBM97434
(100873, 18 | BPH-1375)
Show SMILES NC(=O)c1cc(NC(=O)c2ccc(cc2)C(=O)Nc2cc(cc(c2)C2=NCCN2)C(N)=O)cc(c1)C1=NCCN1 |t:26,39|
Show InChI InChI=1S/C28H26N8O4/c29-23(37)17-9-19(25-31-5-6-32-25)13-21(11-17)35-27(39)15-1-2-16(4-3-15)28(40)36-22-12-18(24(30)38)10-20(14-22)26-33-7-8-34-26/h1-4,9-14H,5-8H2,(H2,29,37)(H2,30,38)(H,31,32)(H,33,34)(H,35,39)(H,36,40)
n/an/a 8.40E+3n/an/an/an/a7.5n/a
University of California San Diego
Assay Description
We screened an in-house library of 43 compounds using GPP as substrate. Briefly, the condensation of IPP and GPP, FPP, or cis-FPP catalyzed by DPPS w...
Chem Biol Drug Des 85: 756-69 (2015)
Article DOI: 10.1111/cbdd.12463
BindingDB Entry DOI: 10.7270/Q2ZG6QZN
Farnesyl diphosphate synthase
(Homo sapiens (Human))
BDBM97434
(100873, 18 | BPH-1375)
Show SMILES NC(=O)c1cc(NC(=O)c2ccc(cc2)C(=O)Nc2cc(cc(c2)C2=NCCN2)C(N)=O)cc(c1)C1=NCCN1 |t:26,39|
Show InChI InChI=1S/C28H26N8O4/c29-23(37)17-9-19(25-31-5-6-32-25)13-21(11-17)35-27(39)15-1-2-16(4-3-15)28(40)36-22-12-18(24(30)38)10-20(14-22)26-33-7-8-34-26/h1-4,9-14H,5-8H2,(H2,29,37)(H2,30,38)(H,31,32)(H,33,34)(H,35,39)(H,36,40)
Reactome pathway
n/an/a 1.07E+4n/an/an/an/a7.425
University of California San Diego
Assay Description
Human FPPS was expressed and purified and inhibition assays carried out as described previously.
Chem Biol Drug Des 81: 742-8 (2013)
Article DOI: 10.1111/cbdd.12121
BindingDB Entry DOI: 10.7270/Q29S1PPZ