BDBM97663 US8476295, 1.1.01
SMILES: C(N1C2CCC1CC(C2)Nc1ccc2[nH]ncc2c1)c1ccccc1
InChI Key: InChIKey=RTCFKJVSDGLJAM-UHFFFAOYSA-N
Data: 2 KI
Activity Spreadsheet -- Enzyme Inhibition Constant Data from BindingDB
Found 2 hits for monomerid = 97663
Trg + Lig
Ki
nM
ΔG°
kcal/mole
IC50
nM
Kd
nM
EC50/IC50
nM
koff
s-1
kon
M-1s-1
pHTemp
°C
Rho kinase 2 (ROCKII)
(Homo sapiens (Human))
BDBM97663
(US8476295, 1.1.01)
Show SMILES C(N1C2CCC1CC(C2)Nc1ccc2[nH]ncc2c1)c1ccccc1 |THB:9:7:3.4:1|
Show InChI InChI=1S/C21H24N4/c1-2-4-15(5-3-1)14-25-19-7-8-20(25)12-18(11-19)23-17-6-9-21-16(10-17)13-22-24-21/h1-6,9-10,13,18-20,23H,7-8,11-12,14H2,(H,22,24)
US Patent
29n/an/an/an/an/an/a7.2n/a
Inspire
US Patent
Assay Description
Inhibition of Rho kinase 2 and Rho kinase I activity was determined using the IMAP Screening Express Kit (Molecular Devices product number #8073).
US Patent US8476295 (2013)
BindingDB Entry DOI: 10.7270/Q2H993TS
Rho-associated protein kinase 1 (ROCK1)
(Homo Sapiens (Human))
BDBM97663
(US8476295, 1.1.01)
Show SMILES C(N1C2CCC1CC(C2)Nc1ccc2[nH]ncc2c1)c1ccccc1 |THB:9:7:3.4:1|
Show InChI InChI=1S/C21H24N4/c1-2-4-15(5-3-1)14-25-19-7-8-20(25)12-18(11-19)23-17-6-9-21-16(10-17)13-22-24-21/h1-6,9-10,13,18-20,23H,7-8,11-12,14H2,(H,22,24)
US Patent
72n/an/an/an/an/an/a7.2n/a
Inspire
US Patent
Assay Description
Inhibition of Rho kinase 2 and Rho kinase I activity was determined using the IMAP Screening Express Kit (Molecular Devices product number #8073).
US Patent US8476295 (2013)
BindingDB Entry DOI: 10.7270/Q2H993TS