null
SMILES: CC(C)(C)NOc1ccc(cc1C(=O)\N=c1/sc(cn1C[C@H]1CCCO1)C(C)(C)C)C(F)(F)F
InChI Key: InChIKey=BKZUGYMHWVXZRF-HXTWZSKRSA-N
Activity Spreadsheet -- Enzyme Inhibition Constant Data from BindingDB
Found 4 hits for monomerid = 9842
Trg + Lig
Ki
nM
ΔG°
kcal/mole
IC50
nM
Kd
nM
EC50/IC50
nM
koff
s-1
kon
M-1s-1
pHTemp
°C
Cannabinoid receptor 2
(Rattus norvegicus (Rat))
BDBM9842
(US8846730, 65 | US8846730, 76)
Show SMILES CC(C)(C)NOc1ccc(cc1C(=O)\N=c1/sc(cn1C[C@H]1CCCO1)C(C)(C)C)C(F)(F)F
Show InChI InChI=1S/C24H32F3N3O3S/c1-22(2,3)19-14-30(13-16-8-7-11-32-16)21(34-19)28-20(31)17-12-15(24(25,26)27)9-10-18(17)33-29-23(4,5)6/h9-10,12,14,16,29H,7-8,11,13H2,1-6H3/b28-21-/t16-/m1/s1
US Patent
0.800 -12.6n/an/an/an/an/a7.430
AbbVie Inc.
US Patent
Assay Description
HEK293 cells stably expressing human CB2 receptors were grown until a confluent monolayer was formed. Briefly, the cells were harvested and homogeniz...
US Patent US8846730 (2014)
BindingDB Entry DOI: 10.7270/Q2028Q6Q
Cannabinoid receptor 2
(Homo sapiens (Human))
BDBM9842
(US8846730, 65 | US8846730, 76)
Show SMILES CC(C)(C)NOc1ccc(cc1C(=O)\N=c1/sc(cn1C[C@H]1CCCO1)C(C)(C)C)C(F)(F)F
Show InChI InChI=1S/C24H32F3N3O3S/c1-22(2,3)19-14-30(13-16-8-7-11-32-16)21(34-19)28-20(31)17-12-15(24(25,26)27)9-10-18(17)33-29-23(4,5)6/h9-10,12,14,16,29H,7-8,11,13H2,1-6H3/b28-21-/t16-/m1/s1
Reactome pathway
US Patent
1.80 -12.1n/an/an/an/an/a7.430
AbbVie Inc.
US Patent
Assay Description
HEK293 cells stably expressing human CB2 receptors were grown until a confluent monolayer was formed. Briefly, the cells were harvested and homogeniz...
US Patent US8846730 (2014)
BindingDB Entry DOI: 10.7270/Q2028Q6Q
Cannabinoid receptor 2
(Rattus norvegicus (Rat))
BDBM9842
(US8846730, 65 | US8846730, 76)
Show SMILES CC(C)(C)NOc1ccc(cc1C(=O)\N=c1/sc(cn1C[C@H]1CCCO1)C(C)(C)C)C(F)(F)F
Show InChI InChI=1S/C24H32F3N3O3S/c1-22(2,3)19-14-30(13-16-8-7-11-32-16)21(34-19)28-20(31)17-12-15(24(25,26)27)9-10-18(17)33-29-23(4,5)6/h9-10,12,14,16,29H,7-8,11,13H2,1-6H3/b28-21-/t16-/m1/s1
US Patent
5.20 -11.5n/an/an/an/an/a7.430
AbbVie Inc.
US Patent
Assay Description
HEK293 cells stably expressing human CB2 receptors were grown until a confluent monolayer was formed. Briefly, the cells were harvested and homogeniz...
US Patent US8846730 (2014)
BindingDB Entry DOI: 10.7270/Q2028Q6Q
Cannabinoid receptor 2
(Homo sapiens (Human))
BDBM9842
(US8846730, 65 | US8846730, 76)
Show SMILES CC(C)(C)NOc1ccc(cc1C(=O)\N=c1/sc(cn1C[C@H]1CCCO1)C(C)(C)C)C(F)(F)F
Show InChI InChI=1S/C24H32F3N3O3S/c1-22(2,3)19-14-30(13-16-8-7-11-32-16)21(34-19)28-20(31)17-12-15(24(25,26)27)9-10-18(17)33-29-23(4,5)6/h9-10,12,14,16,29H,7-8,11,13H2,1-6H3/b28-21-/t16-/m1/s1
Reactome pathway
US Patent
20 -10.7n/an/an/an/an/a7.430
AbbVie Inc.
US Patent
Assay Description
HEK293 cells stably expressing human CB2 receptors were grown until a confluent monolayer was formed. Briefly, the cells were harvested and homogeniz...
US Patent US8846730 (2014)
BindingDB Entry DOI: 10.7270/Q2028Q6Q