BDBM98540 US8492392, 1-11
SMILES: CC(C)Oc1nc(nc2CCN(Cc12)C(=O)Nc1ccc(C)nc1)-c1ccc(Cl)nc1
InChI Key: InChIKey=RUXQZFYHUZKTJB-UHFFFAOYSA-N
Data: 1 KI
Activity Spreadsheet -- Enzyme Inhibition Constant Data from BindingDB
Found 1 hit for monomerid = 98540
Trg + Lig
Ki
nM
ΔG°
kcal/mole
IC50
nM
Kd
nM
EC50/IC50
nM
koff
s-1
kon
M-1s-1
pHTemp
°C
cAMP and cAMP-inhibited cGMP 3',5'-cyclic phosphodiesterase 10A
(Homo sapiens (Human))
BDBM98540
(US8492392, 1-11)
Show SMILES CC(C)Oc1nc(nc2CCN(Cc12)C(=O)Nc1ccc(C)nc1)-c1ccc(Cl)nc1
Show InChI InChI=1S/C22H23ClN6O2/c1-13(2)31-21-17-12-29(22(30)26-16-6-4-14(3)24-11-16)9-8-18(17)27-20(28-21)15-5-7-19(23)25-10-15/h4-7,10-11,13H,8-9,12H2,1-3H3,(H,26,30)
Reactome pathway
US Patent
0.600 -12.6n/an/an/an/an/an/a25
Merck Sharp & Dohme Corp.
US Patent
Assay Description
Fluorescence polarization assay: The compounds of the following examples had activity in reference assays by exhibiting the ability to inhibit the hy...
US Patent US8492392 (2013)
BindingDB Entry DOI: 10.7270/Q2SN07M8