BDBM98634 US8497376, 15
SMILES: CC1(C)CCC(=CC1)c1nc(ccc1NC(=O)c1ncc([nH]1)C#N)C1CC(C)(C)OC(C)(C)C1
InChI Key: InChIKey=BNVPFDRNGHMRJS-UHFFFAOYSA-N
Data: 1 IC50
Activity Spreadsheet -- Enzyme Inhibition Constant Data from BindingDB
Found 1 hit for monomerid = 98634
Trg + Lig
Ki
nM
ΔG°
kcal/mole
IC50
nM
Kd
nM
EC50/IC50
nM
koff
s-1
kon
M-1s-1
pHTemp
°C
Macrophage colony-stimulating factor 1 receptor
(Mus musculus (Mouse))
BDBM98634
(US8497376, 15)
Show SMILES CC1(C)CCC(=CC1)c1nc(ccc1NC(=O)c1ncc([nH]1)C#N)C1CC(C)(C)OC(C)(C)C1 |c:5|
Show InChI InChI=1S/C27H35N5O2/c1-25(2)11-9-17(10-12-25)22-21(32-24(33)23-29-16-19(15-28)30-23)8-7-20(31-22)18-13-26(3,4)34-27(5,6)14-18/h7-9,16,18H,10-14H2,1-6H3,(H,29,30)(H,32,33)
US Patent
n/an/a 2.90n/an/an/an/a7.5n/a
Janssen Pharmaceutica N.V.
US Patent
Assay Description
An autophosphorylation, fluroescence polarization competition immunoassay was used to determine the potency for c-fms inhibition.
US Patent US8497376 (2013)
BindingDB Entry DOI: 10.7270/Q2RN36GW