BDBM98734 US8487093, 78
SMILES: OS(=O)(=O)ON1[C@H]2CN([C@@H](CC2)C(=O)N[C@@H]2CCNC2)C1=O
InChI Key: InChIKey=DGAUUFHQTQVNOS-HLTSFMKQSA-N
Data: 3 IC50
Activity Spreadsheet -- Enzyme Inhibition Constant Data from BindingDB
Found 3 hits for monomerid = 98734
Trg + Lig
Ki
nM
ΔG°
kcal/mole
IC50
nM
Kd
nM
EC50/IC50
nM
koff
s-1
kon
M-1s-1
pHTemp
°C
Beta-lactamase (KPC-2)
(Klebsiella pneumoniae)
BDBM98734
(US8487093, 78)
Show SMILES OS(=O)(=O)ON1[C@H]2CN([C@@H](CC2)C(=O)N[C@@H]2CCNC2)C1=O |r|
Show InChI InChI=1S/C11H18N4O6S/c16-10(13-7-3-4-12-5-7)9-2-1-8-6-14(9)11(17)15(8)21-22(18,19)20/h7-9,12H,1-6H2,(H,13,16)(H,18,19,20)/t7-,8-,9+/m1/s1
US Patent
n/an/a 4.30E+3n/an/an/an/an/an/a
Merck Sharp & Dohme Corp.
US Patent
Assay Description
Enzyme activities were measured in the presence of the test inhibitor in spectrophotometric assay.
US Patent US8487093 (2013)
BindingDB Entry DOI: 10.7270/Q2057DKK
Beta-lactamase
(Acinetobacter baumannii)
BDBM98734
(US8487093, 78)
Show SMILES OS(=O)(=O)ON1[C@H]2CN([C@@H](CC2)C(=O)N[C@@H]2CCNC2)C1=O |r|
Show InChI InChI=1S/C11H18N4O6S/c16-10(13-7-3-4-12-5-7)9-2-1-8-6-14(9)11(17)15(8)21-22(18,19)20/h7-9,12H,1-6H2,(H,13,16)(H,18,19,20)/t7-,8-,9+/m1/s1
n/an/a>5.00E+4n/an/an/an/an/an/a
Merck Research Labs
Curated by ChEMBL
Assay Description
Inhibition of beta-lactamase Oxa40 in Acinetobacter baumannii assessed as inhibition of hydrolysis of nitrocefin
Bioorg Med Chem Lett 24: 780-5 (2014)
Article DOI: 10.1016/j.bmcl.2013.12.101
BindingDB Entry DOI: 10.7270/Q2HD7X41
Beta-lactamase (AmpC)
(Pseudomonas aeruginosa)
BDBM98734
(US8487093, 78)
Show SMILES OS(=O)(=O)ON1[C@H]2CN([C@@H](CC2)C(=O)N[C@@H]2CCNC2)C1=O |r|
Show InChI InChI=1S/C11H18N4O6S/c16-10(13-7-3-4-12-5-7)9-2-1-8-6-14(9)11(17)15(8)21-22(18,19)20/h7-9,12H,1-6H2,(H,13,16)(H,18,19,20)/t7-,8-,9+/m1/s1
US Patent
n/an/a 2.91E+4n/an/an/an/an/an/a
Merck Sharp & Dohme Corp.
US Patent
Assay Description
Enzyme activities were measured in the presence of the test inhibitor in spectrophotometric assay.
US Patent US8487093 (2013)
BindingDB Entry DOI: 10.7270/Q2057DKK