BDBM98748 US8487093, 102
SMILES: OS(=O)(=O)ON1[C@H]2CN([C@@H](CC2)C(=O)N[C@H]2CCN(C3CCNCC3)C2=O)C1=O
InChI Key: InChIKey=WSTRNZBLNKKHSG-AGIUHOORSA-N
Data: 2 IC50
Activity Spreadsheet -- Enzyme Inhibition Constant Data from BindingDB
Found 2 hits for monomerid = 98748
Trg + Lig
Ki
nM
ΔG°
kcal/mole
IC50
nM
Kd
nM
EC50/IC50
nM
koff
s-1
kon
M-1s-1
pHTemp
°C
Beta-lactamase (AmpC)
(Pseudomonas aeruginosa)
BDBM98748
(US8487093, 102)
Show SMILES OS(=O)(=O)ON1[C@H]2CN([C@@H](CC2)C(=O)N[C@H]2CCN(C3CCNCC3)C2=O)C1=O |r|
Show InChI InChI=1S/C16H25N5O7S/c22-14(18-12-5-8-19(15(12)23)10-3-6-17-7-4-10)13-2-1-11-9-20(13)16(24)21(11)28-29(25,26)27/h10-13,17H,1-9H2,(H,18,22)(H,25,26,27)/t11-,12+,13+/m1/s1
US Patent
n/an/a 620n/an/an/an/an/an/a
Merck Sharp & Dohme Corp.
US Patent
Assay Description
Enzyme activities were measured in the presence of the test inhibitor in spectrophotometric assay.
US Patent US8487093 (2013)
BindingDB Entry DOI: 10.7270/Q2057DKK
Beta-lactamase (KPC-2)
(Klebsiella pneumoniae)
BDBM98748
(US8487093, 102)
Show SMILES OS(=O)(=O)ON1[C@H]2CN([C@@H](CC2)C(=O)N[C@H]2CCN(C3CCNCC3)C2=O)C1=O |r|
Show InChI InChI=1S/C16H25N5O7S/c22-14(18-12-5-8-19(15(12)23)10-3-6-17-7-4-10)13-2-1-11-9-20(13)16(24)21(11)28-29(25,26)27/h10-13,17H,1-9H2,(H,18,22)(H,25,26,27)/t11-,12+,13+/m1/s1
US Patent
n/an/a 21n/an/an/an/an/an/a
Merck Sharp & Dohme Corp.
US Patent
Assay Description
Enzyme activities were measured in the presence of the test inhibitor in spectrophotometric assay.
US Patent US8487093 (2013)
BindingDB Entry DOI: 10.7270/Q2057DKK