BDBM98755 US8487093, 116
SMILES: OS(=O)(=O)ON1[C@H]2CN([C@@H](CC2)C(=O)NCC2CCNCC2)C1=O
InChI Key: InChIKey=DSIOHNDCLFKUPP-MNOVXSKESA-N
Data: 3 IC50
Activity Spreadsheet -- Enzyme Inhibition Constant Data from BindingDB
Found 3 hits for monomerid = 98755
Trg + Lig
Ki
nM
ΔG°
kcal/mole
IC50
nM
Kd
nM
EC50/IC50
nM
koff
s-1
kon
M-1s-1
pHTemp
°C
Beta-lactamase (KPC-2)
(Klebsiella pneumoniae)
BDBM98755
(US8487093, 116)
Show SMILES OS(=O)(=O)ON1[C@H]2CN([C@@H](CC2)C(=O)NCC2CCNCC2)C1=O |r|
Show InChI InChI=1S/C13H22N4O6S/c18-12(15-7-9-3-5-14-6-4-9)11-2-1-10-8-16(11)13(19)17(10)23-24(20,21)22/h9-11,14H,1-8H2,(H,15,18)(H,20,21,22)/t10-,11+/m1/s1
US Patent
n/an/a 77n/an/an/an/an/an/a
Merck Sharp & Dohme Corp.
US Patent
Assay Description
Enzyme activities were measured in the presence of the test inhibitor in spectrophotometric assay.
US Patent US8487093 (2013)
BindingDB Entry DOI: 10.7270/Q2057DKK
Beta-lactamase
(Acinetobacter baumannii)
BDBM98755
(US8487093, 116)
Show SMILES OS(=O)(=O)ON1[C@H]2CN([C@@H](CC2)C(=O)NCC2CCNCC2)C1=O |r|
Show InChI InChI=1S/C13H22N4O6S/c18-12(15-7-9-3-5-14-6-4-9)11-2-1-10-8-16(11)13(19)17(10)23-24(20,21)22/h9-11,14H,1-8H2,(H,15,18)(H,20,21,22)/t10-,11+/m1/s1
n/an/a>5.00E+4n/an/an/an/an/an/a
Merck Research Labs
Curated by ChEMBL
Assay Description
Inhibition of beta-lactamase Oxa40 in Acinetobacter baumannii assessed as inhibition of hydrolysis of nitrocefin
Bioorg Med Chem Lett 24: 780-5 (2014)
Article DOI: 10.1016/j.bmcl.2013.12.101
BindingDB Entry DOI: 10.7270/Q2HD7X41
Beta-lactamase (AmpC)
(Pseudomonas aeruginosa)
BDBM98755
(US8487093, 116)
Show SMILES OS(=O)(=O)ON1[C@H]2CN([C@@H](CC2)C(=O)NCC2CCNCC2)C1=O |r|
Show InChI InChI=1S/C13H22N4O6S/c18-12(15-7-9-3-5-14-6-4-9)11-2-1-10-8-16(11)13(19)17(10)23-24(20,21)22/h9-11,14H,1-8H2,(H,15,18)(H,20,21,22)/t10-,11+/m1/s1
US Patent
n/an/a 30n/an/an/an/an/an/a
Merck Sharp & Dohme Corp.
US Patent
Assay Description
Enzyme activities were measured in the presence of the test inhibitor in spectrophotometric assay.
US Patent US8487093 (2013)
BindingDB Entry DOI: 10.7270/Q2057DKK