BDBM98785 US8487093, 168
SMILES: OS(=O)(=O)ON1[C@H]2CN([C@@H](CC2)C(=O)Nc2ccc3NCCc3c2)C1=O
InChI Key: InChIKey=YDFKPYASAXCUNQ-YPMHNXCESA-N
Data: 2 IC50
Activity Spreadsheet -- Enzyme Inhibition Constant Data from BindingDB
Found 2 hits for monomerid = 98785
Trg + Lig
Ki
nM
ΔG°
kcal/mole
IC50
nM
Kd
nM
EC50/IC50
nM
koff
s-1
kon
M-1s-1
pHTemp
°C
Beta-lactamase (AmpC)
(Pseudomonas aeruginosa)
BDBM98785
(US8487093, 168)
Show SMILES OS(=O)(=O)ON1[C@H]2CN([C@@H](CC2)C(=O)Nc2ccc3NCCc3c2)C1=O |r|
Show InChI InChI=1S/C15H18N4O6S/c20-14(17-10-1-3-12-9(7-10)5-6-16-12)13-4-2-11-8-18(13)15(21)19(11)25-26(22,23)24/h1,3,7,11,13,16H,2,4-6,8H2,(H,17,20)(H,22,23,24)/t11-,13+/m1/s1
US Patent
n/an/a 56n/an/an/an/an/an/a
Merck Sharp & Dohme Corp.
US Patent
Assay Description
Enzyme activities were measured in the presence of the test inhibitor in spectrophotometric assay.
US Patent US8487093 (2013)
BindingDB Entry DOI: 10.7270/Q2057DKK
Beta-lactamase (KPC-2)
(Klebsiella pneumoniae)
BDBM98785
(US8487093, 168)
Show SMILES OS(=O)(=O)ON1[C@H]2CN([C@@H](CC2)C(=O)Nc2ccc3NCCc3c2)C1=O |r|
Show InChI InChI=1S/C15H18N4O6S/c20-14(17-10-1-3-12-9(7-10)5-6-16-12)13-4-2-11-8-18(13)15(21)19(11)25-26(22,23)24/h1,3,7,11,13,16H,2,4-6,8H2,(H,17,20)(H,22,23,24)/t11-,13+/m1/s1
US Patent
n/an/a 41n/an/an/an/an/an/a
Merck Sharp & Dohme Corp.
US Patent
Assay Description
Enzyme activities were measured in the presence of the test inhibitor in spectrophotometric assay.
US Patent US8487093 (2013)
BindingDB Entry DOI: 10.7270/Q2057DKK