BDBM98790 US8487093, 176
SMILES: NC(=O)c1cccc(NC(=O)[C@@H]2CC[C@@H]3CN2C(=O)N3OS(O)(=O)=O)c1
InChI Key: InChIKey=UQIZDXYPKMTENB-MNOVXSKESA-N
Data: 2 IC50
Activity Spreadsheet -- Enzyme Inhibition Constant Data from BindingDB
Found 2 hits for monomerid = 98790
Trg + Lig
Ki
nM
ΔG°
kcal/mole
IC50
nM
Kd
nM
EC50/IC50
nM
koff
s-1
kon
M-1s-1
pHTemp
°C
Beta-lactamase (AmpC)
(Pseudomonas aeruginosa)
BDBM98790
(US8487093, 176)
Show SMILES NC(=O)c1cccc(NC(=O)[C@@H]2CC[C@@H]3CN2C(=O)N3OS(O)(=O)=O)c1 |r|
Show InChI InChI=1S/C14H16N4O7S/c15-12(19)8-2-1-3-9(6-8)16-13(20)11-5-4-10-7-17(11)14(21)18(10)25-26(22,23)24/h1-3,6,10-11H,4-5,7H2,(H2,15,19)(H,16,20)(H,22,23,24)/t10-,11+/m1/s1
US Patent
n/an/a 3n/an/an/an/an/an/a
Merck Sharp & Dohme Corp.
US Patent
Assay Description
Enzyme activities were measured in the presence of the test inhibitor in spectrophotometric assay.
US Patent US8487093 (2013)
BindingDB Entry DOI: 10.7270/Q2057DKK
Beta-lactamase (KPC-2)
(Klebsiella pneumoniae)
BDBM98790
(US8487093, 176)
Show SMILES NC(=O)c1cccc(NC(=O)[C@@H]2CC[C@@H]3CN2C(=O)N3OS(O)(=O)=O)c1 |r|
Show InChI InChI=1S/C14H16N4O7S/c15-12(19)8-2-1-3-9(6-8)16-13(20)11-5-4-10-7-17(11)14(21)18(10)25-26(22,23)24/h1-3,6,10-11H,4-5,7H2,(H2,15,19)(H,16,20)(H,22,23,24)/t10-,11+/m1/s1
US Patent
n/an/a 26n/an/an/an/an/an/a
Merck Sharp & Dohme Corp.
US Patent
Assay Description
Enzyme activities were measured in the presence of the test inhibitor in spectrophotometric assay.
US Patent US8487093 (2013)
BindingDB Entry DOI: 10.7270/Q2057DKK