BDBM98839 US8487093, 252
SMILES: OS(=O)(=O)ON1[C@H]2CN([C@@H](CC2)C(=O)O[C@@H]2CNOC2)C1=O
InChI Key: InChIKey=DHXJEQFETGTRCK-PRJMDXOYSA-N
Data: 2 IC50
Activity Spreadsheet -- Enzyme Inhibition Constant Data from BindingDB
Found 2 hits for monomerid = 98839
Trg + Lig
Ki
nM
ΔG°
kcal/mole
IC50
nM
Kd
nM
EC50/IC50
nM
koff
s-1
kon
M-1s-1
pHTemp
°C
Beta-lactamase (AmpC)
(Pseudomonas aeruginosa)
BDBM98839
(US8487093, 252)
Show SMILES OS(=O)(=O)ON1[C@H]2CN([C@@H](CC2)C(=O)O[C@@H]2CNOC2)C1=O |r|
Show InChI InChI=1S/C10H15N3O8S/c14-9(20-7-3-11-19-5-7)8-2-1-6-4-12(8)10(15)13(6)21-22(16,17)18/h6-8,11H,1-5H2,(H,16,17,18)/t6-,7-,8+/m1/s1
US Patent
n/an/a 62n/an/an/an/an/an/a
Merck Sharp & Dohme Corp.
US Patent
Assay Description
Enzyme activities were measured in the presence of the test inhibitor in spectrophotometric assay.
US Patent US8487093 (2013)
BindingDB Entry DOI: 10.7270/Q2057DKK
Beta-lactamase (KPC-2)
(Klebsiella pneumoniae)
BDBM98839
(US8487093, 252)
Show SMILES OS(=O)(=O)ON1[C@H]2CN([C@@H](CC2)C(=O)O[C@@H]2CNOC2)C1=O |r|
Show InChI InChI=1S/C10H15N3O8S/c14-9(20-7-3-11-19-5-7)8-2-1-6-4-12(8)10(15)13(6)21-22(16,17)18/h6-8,11H,1-5H2,(H,16,17,18)/t6-,7-,8+/m1/s1
US Patent
n/an/a 11n/an/an/an/an/an/a
Merck Sharp & Dohme Corp.
US Patent
Assay Description
Enzyme activities were measured in the presence of the test inhibitor in spectrophotometric assay.
US Patent US8487093 (2013)
BindingDB Entry DOI: 10.7270/Q2057DKK