BDBM98844 US8487093, 260
SMILES: OS(=O)(=O)ON1[C@H]2CN([C@@H](CC2)C(=O)OCCC2CCNCC2)C1=O
InChI Key: InChIKey=XKNAWQSFSZRWHU-NEPJUHHUSA-N
Data: 2 IC50
Activity Spreadsheet -- Enzyme Inhibition Constant Data from BindingDB
Found 2 hits for monomerid = 98844
Trg + Lig
Ki
nM
ΔG°
kcal/mole
IC50
nM
Kd
nM
EC50/IC50
nM
koff
s-1
kon
M-1s-1
pHTemp
°C
Beta-lactamase (AmpC)
(Pseudomonas aeruginosa)
BDBM98844
(US8487093, 260)
Show SMILES OS(=O)(=O)ON1[C@H]2CN([C@@H](CC2)C(=O)OCCC2CCNCC2)C1=O |r|
Show InChI InChI=1S/C14H23N3O7S/c18-13(23-8-5-10-3-6-15-7-4-10)12-2-1-11-9-16(12)14(19)17(11)24-25(20,21)22/h10-12,15H,1-9H2,(H,20,21,22)/t11-,12+/m1/s1
US Patent
n/an/a 165n/an/an/an/an/an/a
Merck Sharp & Dohme Corp.
US Patent
Assay Description
Enzyme activities were measured in the presence of the test inhibitor in spectrophotometric assay.
US Patent US8487093 (2013)
BindingDB Entry DOI: 10.7270/Q2057DKK
Beta-lactamase (KPC-2)
(Klebsiella pneumoniae)
BDBM98844
(US8487093, 260)
Show SMILES OS(=O)(=O)ON1[C@H]2CN([C@@H](CC2)C(=O)OCCC2CCNCC2)C1=O |r|
Show InChI InChI=1S/C14H23N3O7S/c18-13(23-8-5-10-3-6-15-7-4-10)12-2-1-11-9-16(12)14(19)17(11)24-25(20,21)22/h10-12,15H,1-9H2,(H,20,21,22)/t11-,12+/m1/s1
US Patent
n/an/a 13n/an/an/an/an/an/a
Merck Sharp & Dohme Corp.
US Patent
Assay Description
Enzyme activities were measured in the presence of the test inhibitor in spectrophotometric assay.
US Patent US8487093 (2013)
BindingDB Entry DOI: 10.7270/Q2057DKK