BDBM99583 US8501936, 82
SMILES: CN1CCN(CC1)c1ccc(Nc2nc3cccc(-c4cccc(c4)S(C)(=O)=O)n3n2)cc1
InChI Key: InChIKey=XEFMGFQXNLZBQW-UHFFFAOYSA-N
Data: 1 KI  4 IC50
Activity Spreadsheet -- Enzyme Inhibition Constant Data from BindingDB
Found 5 hits for monomerid = 99583
Trg + Lig
Ki
nM
ΔG°
kcal/mole
IC50
nM
Kd
nM
EC50/IC50
nM
koff
s-1
kon
M-1s-1
pHTemp
°C
Tyrosine-protein kinase JAK2
(Homo sapiens (Human))
BDBM99583
(US8501936, 82)
Show SMILES CN1CCN(CC1)c1ccc(Nc2nc3cccc(-c4cccc(c4)S(C)(=O)=O)n3n2)cc1
Show InChI InChI=1S/C24H26N6O2S/c1-28-13-15-29(16-14-28)20-11-9-19(10-12-20)25-24-26-23-8-4-7-22(30(23)27-24)18-5-3-6-21(17-18)33(2,31)32/h3-12,17H,13-16H2,1-2H3,(H,25,27)
Reactome pathway
2n/an/an/an/an/an/an/an/a
Genentech
Curated by ChEMBL
Assay Description
Inhibition of JAK2 (unknown origin)
Bioorg Med Chem Lett 23: 5014-21 (2013)
Article DOI: 10.1016/j.bmcl.2013.06.008
BindingDB Entry DOI: 10.7270/Q29S1SF2
Tyrosine-protein kinase JAK3
(Homo sapiens (Human))
BDBM99583
(US8501936, 82)
Show SMILES CN1CCN(CC1)c1ccc(Nc2nc3cccc(-c4cccc(c4)S(C)(=O)=O)n3n2)cc1
Show InChI InChI=1S/C24H26N6O2S/c1-28-13-15-29(16-14-28)20-11-9-19(10-12-20)25-24-26-23-8-4-7-22(30(23)27-24)18-5-3-6-21(17-18)33(2,31)32/h3-12,17H,13-16H2,1-2H3,(H,25,27)
Reactome pathway
US Patent
n/an/a 138n/an/an/an/an/an/a
Cephalon, Inc.
US Patent
Assay Description
The ability of compounds to inhibit the kinase activity of baculovirus-expressed human FAK and JAK kinase using the time-resolved fluorescence (TRF) ...
US Patent US8501936 (2013)
BindingDB Entry DOI: 10.7270/Q22Z1455
Tyrosine-protein kinase JAK2
(Homo sapiens (Human))
BDBM99583
(US8501936, 82)
Show SMILES CN1CCN(CC1)c1ccc(Nc2nc3cccc(-c4cccc(c4)S(C)(=O)=O)n3n2)cc1
Show InChI InChI=1S/C24H26N6O2S/c1-28-13-15-29(16-14-28)20-11-9-19(10-12-20)25-24-26-23-8-4-7-22(30(23)27-24)18-5-3-6-21(17-18)33(2,31)32/h3-12,17H,13-16H2,1-2H3,(H,25,27)
Reactome pathway
US Patent
n/an/a 9.20n/an/an/an/an/an/a
Cephalon, Inc.
US Patent
Assay Description
The ability of compounds to inhibit the kinase activity of baculovirus-expressed human FAK and JAK kinase using the time-resolved fluorescence (TRF) ...
US Patent US8501936 (2013)
BindingDB Entry DOI: 10.7270/Q22Z1455
Tyrosine-protein kinase JAK2
(Homo sapiens (Human))
BDBM99583
(US8501936, 82)
Show SMILES CN1CCN(CC1)c1ccc(Nc2nc3cccc(-c4cccc(c4)S(C)(=O)=O)n3n2)cc1
Show InChI InChI=1S/C24H26N6O2S/c1-28-13-15-29(16-14-28)20-11-9-19(10-12-20)25-24-26-23-8-4-7-22(30(23)27-24)18-5-3-6-21(17-18)33(2,31)32/h3-12,17H,13-16H2,1-2H3,(H,25,27)
Reactome pathway
n/an/a 73n/an/an/an/an/an/a
Genentech
Curated by ChEMBL
Assay Description
Inhibition of JAK2 in human SET2 cells assessed as reduction of phosphorylated STAT5 level
Bioorg Med Chem Lett 23: 5014-21 (2013)
Article DOI: 10.1016/j.bmcl.2013.06.008
BindingDB Entry DOI: 10.7270/Q29S1SF2
Focal adhesion kinase 1
(Homo sapiens (Human))
BDBM99583
(US8501936, 82)
Show SMILES CN1CCN(CC1)c1ccc(Nc2nc3cccc(-c4cccc(c4)S(C)(=O)=O)n3n2)cc1
Show InChI InChI=1S/C24H26N6O2S/c1-28-13-15-29(16-14-28)20-11-9-19(10-12-20)25-24-26-23-8-4-7-22(30(23)27-24)18-5-3-6-21(17-18)33(2,31)32/h3-12,17H,13-16H2,1-2H3,(H,25,27)
NCI pathway
Reactome pathway
US Patent
n/an/a 584n/an/an/an/an/an/a
Cephalon, Inc.
US Patent
Assay Description
The ability of compounds to inhibit the kinase activity of baculovirus-expressed human FAK and JAK kinase using the time-resolved fluorescence (TRF) ...
US Patent US8501936 (2013)
BindingDB Entry DOI: 10.7270/Q22Z1455