BDBM9985 (2S,6R,15S)-6-hydroxy-2-(hydroxymethyl)-15-methyltetracyclo[8.7.0.0^{2,7}.0^{11,15}]heptadec-7-en-14-one::4alpha,19-Dihydroxyandrost-5-en-17-one::Hydroxylated 3-Deoxy C19 Steroid 25
SMILES: C[C@]12CCC3C(CC=C4[C@H](O)CCC[C@]34CO)C1CCC2=O
InChI Key: InChIKey=HGXZNIOSVPOXRE-QNSFZFNSSA-N
Data: 1 KI  1 IC50
PDB links: 5 PDB IDs contain inhibitors having a similarity of 90% to this monomer.
Activity Spreadsheet -- Enzyme Inhibition Constant Data from BindingDB
Found 1 hit for monomerid = 9985
Trg + Lig
Ki
nM
ΔG°
kcal/mole
IC50
nM
Kd
nM
EC50/IC50
nM
koff
s-1
kon
M-1s-1
pHTemp
°C
Cytochrome P450 19A1
(Homo sapiens (Human))
BDBM9985
((2S,6R,15S)-6-hydroxy-2-(hydroxymethyl)-15-methylt...)
Show SMILES C[C@]12CCC3C(CC=C4[C@H](O)CCC[C@]34CO)C1CCC2=O |r,t:7|
Show InChI InChI=1S/C19H28O3/c1-18-10-8-14-12(13(18)6-7-17(18)22)4-5-15-16(21)3-2-9-19(14,15)11-20/h5,12-14,16,20-21H,2-4,6-11H2,1H3/t12?,13?,14?,16-,18+,19+/m1/s1
Reactome pathway
800 -8.65 6.80E+3n/an/an/an/a7.537
Tohoku Pharmaceutical University
Assay Description
The enzyme activity was assayed by measuring the 3H-labeled H2O formed from [1beta-3H] Androstenedione during aromatization. After incubation, the re...
J Med Chem 44: 4277-83 (2001)
Article DOI: 10.1021/jm010282t
BindingDB Entry DOI: 10.7270/Q2SB43ZH