Reaction Details
TargetFibroblast growth factor receptor 3
LigandBDBM507054
Substrate/Competitorn/a
Meas. Tech.FGFR3 Enzyme Inhibition
Ki 8.32±n/a nM
Citation Walters, IBirch, LHill-Cousins, JCollingwood, SPStevenson, CS Indolinones compounds and their use in the treatment of fibrotic diseases US Patent US11046672 Publication Date 6/29/2021
 
Fibroblast growth factor receptor 3
Name:Fibroblast growth factor receptor 3
Type:Protein
Mol. Mass.:87699.57
Organism:Homo sapiens (Human)
Description:P22607
Residue:806
BDBM507054
NameBDBM507054
Synonyms:(Z)-Methyl 3-(((4-((2-(dimethylamino)ethoxy)carbamoyl)phenyl)amino)(phenyl)methylene)-2-oxoindoline-6-carboxylate US11046672, Example 3
TypeSmall organic molecule
Emp. Form.C28H28N4O5
Mol. Mass.500.5457
SMILESCOC(=O)c1ccc2\C(=C(\Nc3ccc(cc3)C(=O)NOCCN(C)C)c3ccccc3)C(=O)Nc2c1