Reaction Details
TargetFibroblast growth factor receptor 3
LigandBDBM507056
Substrate/Competitorn/a
Meas. Tech.FGFR3 Enzyme Inhibition
Ki 6.78±n/a nM
Citation Walters, IBirch, LHill-Cousins, JCollingwood, SPStevenson, CS Indolinones compounds and their use in the treatment of fibrotic diseases US Patent US11046672 Publication Date 6/29/2021
 
Fibroblast growth factor receptor 3
Name:Fibroblast growth factor receptor 3
Type:Protein
Mol. Mass.:87699.57
Organism:Homo sapiens (Human)
Description:P22607
Residue:806
BDBM507056
NameBDBM507056
Synonyms:(Z)-Methyl 3-(((4-((2-(dimethylamino)ethoxy)carbamoyl)-3-methylphenyl)amino)(phenyl)methylene)-5-methyl-2-oxoindoline-6-carboxylate | US11046672, Example 5
TypeSmall organic molecule
Emp. Form.C30H32N4O5
Mol. Mass.528.5989
SMILESCOC(=O)c1cc2NC(=O)\C(=C(/Nc3ccc(C(=O)NOCCN(C)C)c(C)c3)c3ccccc3)c2cc1C