Reaction Details
TargetPlatelet-derived growth factor receptor beta
LigandBDBM507056
Substrate/Competitorn/a
Meas. Tech.PDGFRbeta Enzyme Inhibition
Ki 7.13±n/a nM
Citation Walters, IBirch, LHill-Cousins, JCollingwood, SPStevenson, CS Indolinones compounds and their use in the treatment of fibrotic diseases US Patent US11046672 Publication Date 6/29/2021
 
Platelet-derived growth factor receptor beta
Name:Platelet-derived growth factor receptor beta
Type:Enzyme
Mol. Mass.:123922.25
Organism:Homo sapiens (Human)
Description:P09619
Residue:1106
BDBM507056
NameBDBM507056
Synonyms:(Z)-Methyl 3-(((4-((2-(dimethylamino)ethoxy)carbamoyl)-3-methylphenyl)amino)(phenyl)methylene)-5-methyl-2-oxoindoline-6-carboxylate | US11046672, Example 5
TypeSmall organic molecule
Emp. Form.C30H32N4O5
Mol. Mass.528.5989
SMILESCOC(=O)c1cc2NC(=O)\C(=C(/Nc3ccc(C(=O)NOCCN(C)C)c(C)c3)c3ccccc3)c2cc1C