Reaction Details
TargetPlatelet-derived growth factor receptor beta
LigandBDBM507057
Substrate/Competitorn/a
Meas. Tech.PDGFRbeta Enzyme Inhibition
Ki 8.31±n/a nM
Citation Walters, IBirch, LHill-Cousins, JCollingwood, SPStevenson, CS Indolinones compounds and their use in the treatment of fibrotic diseases US Patent US11046672 Publication Date 6/29/2021
 
Platelet-derived growth factor receptor beta
Name:Platelet-derived growth factor receptor beta
Type:Enzyme
Mol. Mass.:123922.25
Organism:Homo sapiens (Human)
Description:P09619
Residue:1106
BDBM507057
NameBDBM507057
Synonyms:(Z)-Methyl 5-methyl-3-(((4-((2-(4-methylpiperazin-1-yl)ethoxy)carbamoyl)phenyl)amino)(phenyl)methylene)-2-oxoindoline-6-carboxylate | US11046672, Example 6
TypeSmall organic molecule
Emp. Form.C32H35N5O5
Mol. Mass.569.6508
SMILESCOC(=O)c1cc2NC(=O)\C(=C(/Nc3ccc(cc3)C(=O)NOCCN3CCN(C)CC3)c3ccccc3)c2cc1C