Reaction Details
TargetPlatelet-derived growth factor receptor beta
LigandBDBM507058
Substrate/Competitorn/a
Meas. Tech.PDGFRbeta Enzyme Inhibition
Ki 6.60±n/a nM
Citation Walters, IBirch, LHill-Cousins, JCollingwood, SPStevenson, CS Indolinones compounds and their use in the treatment of fibrotic diseases US Patent US11046672 Publication Date 6/29/2021
 
Platelet-derived growth factor receptor beta
Name:Platelet-derived growth factor receptor beta
Type:Enzyme
Mol. Mass.:123922.25
Organism:Homo sapiens (Human)
Description:P09619
Residue:1106
BDBM507058
NameBDBM507058
Synonyms:(Z)-Methyl 3-(((4-((2-(4-(2-hydroxyethyl)piperazin-1-yl)ethoxy)carbamoyl)phenyl)amino)(phenyl)methylene)-5-methyl-2-oxoindoline-6-carboxylate, formate | US11046672, Example 7
TypeSmall organic molecule
Emp. Form.C33H37N5O6
Mol. Mass.599.6768
SMILESCOC(=O)c1cc2NC(=O)\C(=C(/Nc3ccc(cc3)C(=O)NOCCN3CCN(CCO)CC3)c3ccccc3)c2cc1C