Reaction Details
TargetPlatelet-derived growth factor receptor beta
LigandBDBM507083
Substrate/Competitorn/a
Meas. Tech.PDGFRbeta Enzyme Inhibition
Ki 4.92±n/a nM
Citation Walters, IBirch, LHill-Cousins, JCollingwood, SPStevenson, CS Indolinones compounds and their use in the treatment of fibrotic diseases US Patent US11046672 Publication Date 6/29/2021
 
Platelet-derived growth factor receptor beta
Name:Platelet-derived growth factor receptor beta
Type:Enzyme
Mol. Mass.:123922.25
Organism:Homo sapiens (Human)
Description:P09619
Residue:1106
BDBM507083
NameBDBM507083
Synonyms:US11046672, Example 32
TypeSmall organic molecule
Emp. Form.C32H34FN5O5
Mol. Mass.587.6413
SMILESCOC(=O)c1cc2NC(=O)\C(=C(/Nc3ccc(C(=O)NOCCN4CCN(C)CC4)c(F)c3)c3ccccc3)c2cc1C