Reaction Details
TargetPlatelet-derived growth factor receptor beta
LigandBDBM507087
Substrate/Competitorn/a
Meas. Tech.PDGFRbeta Enzyme Inhibition
Ki 8.46±n/a nM
Citation Walters, IBirch, LHill-Cousins, JCollingwood, SPStevenson, CS Indolinones compounds and their use in the treatment of fibrotic diseases US Patent US11046672 Publication Date 6/29/2021
 
Platelet-derived growth factor receptor beta
Name:Platelet-derived growth factor receptor beta
Type:Enzyme
Mol. Mass.:123922.25
Organism:Homo sapiens (Human)
Description:P09619
Residue:1106
BDBM507087
NameBDBM507087
Synonyms:US11046672, Example 36
TypeSmall organic molecule
Emp. Form.C33H37N5O5
Mol. Mass.583.6774
SMILESCCN1CCN(CCONC(=O)c2ccc(N\C(=C3/C(=O)Nc4cc(C(=O)OC)c(C)cc34)c3ccccc3)cc2)CC1