Reaction Details
TargetPlatelet-derived growth factor receptor beta
LigandBDBM507093
Substrate/Competitorn/a
Meas. Tech.PDGFRbeta Enzyme Inhibition
Ki 7.06±n/a nM
Citation Walters, IBirch, LHill-Cousins, JCollingwood, SPStevenson, CS Indolinones compounds and their use in the treatment of fibrotic diseases US Patent US11046672 Publication Date 6/29/2021
 
Platelet-derived growth factor receptor beta
Name:Platelet-derived growth factor receptor beta
Type:Enzyme
Mol. Mass.:123922.25
Organism:Homo sapiens (Human)
Description:P09619
Residue:1106
BDBM507093
NameBDBM507093
Synonyms:US11046672, Example 42
TypeSmall organic molecule
Emp. Form.C30H29N5O6
Mol. Mass.555.5812
SMILESCOC(=O)c1ccc2\C(=C(\Nc3ccc(cc3)C(=O)NOCCN3CCNC(=O)C3)c3ccccc3)C(=O)Nc2c1