Reaction Details
TargetFibroblast growth factor receptor 3
LigandBDBM507113
Substrate/Competitorn/a
Meas. Tech.FGFR3 Enzyme Inhibition
Ki 6.78±n/a nM
Citation Walters, IBirch, LHill-Cousins, JCollingwood, SPStevenson, CS Indolinones compounds and their use in the treatment of fibrotic diseases US Patent US11046672 Publication Date 6/29/2021
 
Fibroblast growth factor receptor 3
Name:Fibroblast growth factor receptor 3
Type:Protein
Mol. Mass.:87699.57
Organism:Homo sapiens (Human)
Description:P22607
Residue:806
BDBM507113
NameBDBM507113
Synonyms:US11046672, Example 62
TypeSmall organic molecule
Emp. Form.C33H37N5O5
Mol. Mass.583.6774
SMILESCOC(=O)c1cc2NC(=O)\C(=C(/Nc3ccc(cc3)C(=O)N(C)OCCN3CCN[C@@H](C)C3)c3ccccc3)c2cc1C