Reaction Details
TargetFibroblast growth factor receptor 3
LigandBDBM507122
Substrate/Competitorn/a
Meas. Tech.FGFR3 Enzyme Inhibition
Ki 7.90±n/a nM
Citation Walters, IBirch, LHill-Cousins, JCollingwood, SPStevenson, CS Indolinones compounds and their use in the treatment of fibrotic diseases US Patent US11046672 Publication Date 6/29/2021
 
Fibroblast growth factor receptor 3
Name:Fibroblast growth factor receptor 3
Type:Protein
Mol. Mass.:87699.57
Organism:Homo sapiens (Human)
Description:P22607
Residue:806
BDBM507122
NameBDBM507122
Synonyms:US11046672, Example 73
TypeSmall organic molecule
Emp. Form.C34H38N6O6
Mol. Mass.626.7021
SMILESCNC(=O)CN1CCN(CCONC(=O)c2ccc(N\C(=C3/C(=O)Nc4cc(C(=O)OC)c(C)cc34)c3ccccc3)cc2)CC1