Reaction Details
TargetProto-oncogene tyrosine-protein kinase receptor Ret
LigandBDBM311586
Substrate/Competitorn/a
Meas. Tech.Measurement of Inhibitory Activity Against RET (In Vitro)
IC50 0.300±n/a nM
Citation Miyazaki, IShimamura, TKato, MFujita, HIguchi, S Fused pyrimidine compound or salt thereof US Patent US11046696 Publication Date 6/29/2021
 
Proto-oncogene tyrosine-protein kinase receptor Ret
Name:Proto-oncogene tyrosine-protein kinase receptor Ret
Type:Protein
Mol. Mass.:124318.29
Organism:Homo sapiens (Human)
Description:P07949
Residue:1114
BDBM311586
NameBDBM311586
Synonyms:Ex. Cpd. 23 US11046696, Compound 23
TypeSmall organic molecule
Emp. Form.C18H22N6OS
Mol. Mass.370.472
SMILESCSCc1ccc(NC(=O)c2nn(c3ncnc(N)c23)C(C)(C)C)cc1