Reaction Details
TargetProto-oncogene tyrosine-protein kinase receptor Ret
LigandBDBM311643
Substrate/Competitorn/a
Meas. Tech.Measurement of Inhibitory Activity Against RET (In Vitro)
IC50 0.200±n/a nM
Citation Miyazaki, IShimamura, TKato, MFujita, HIguchi, S Fused pyrimidine compound or salt thereof US Patent US11046696 Publication Date 6/29/2021
 
Proto-oncogene tyrosine-protein kinase receptor Ret
Name:Proto-oncogene tyrosine-protein kinase receptor Ret
Type:Protein
Mol. Mass.:124318.29
Organism:Homo sapiens (Human)
Description:P07949
Residue:1114
BDBM311643
NameBDBM311643
Synonyms:Ex. Cpd. 95 US11046696, Compound 95
TypeSmall organic molecule
Emp. Form.C22H23N5O2
Mol. Mass.389.4503
SMILESCOCc1ccc(NC(=O)c2c(C#CC)n(c3ncnc(N)c23)C2(C)CC2)cc1