Reaction Details
TargetMethylosome protein 50/Protein arginine N-methyltransferase 5
LigandBDBM515307
Substrate/Competitorn/a
Meas. Tech.Enzyme Methylation Assay
IC50 0.290±n/a nM
Citation Machacek, MRWitter, DJReutershan, MHSloman, DLAltman, MD PRMT5 inhibitors US Patent US11098059 Publication Date 8/24/2021
 
Methylosome protein 50/Protein arginine N-methyltransferase 5
Name:Methylosome protein 50/Protein arginine N-methyltransferase 5
Type:Protein
Mol. Mass.:n/a
Description:n/a
Components:This complex has 2 components.
Component 1
Name:Protein arginine N-methyltransferase 5
Synonyms:72 kDa ICln-binding protein HRMT1L5 IBP72 Jak-binding protein 1 PRMT5/MEP50 complex Protein arginine methyltransferase 5 (PRMT5) SKB1 homolog Shk1 kinase-binding protein 1 homolog
Type:Enzyme
Mol. Mass.:72679.99
Organism:Homo sapiens (Human)
Description:O14744
Residue:637
Component 2
Name:Methylosome protein 50
Synonyms:Androgen receptor cofactor p44 MEP50 Nbla10071 WD45 p44/Mep50
Type:Enzyme
Mol. Mass.:36713.38
Organism:Homo sapiens (Human)
Description:Q9BQA1
Residue:342
BDBM515307
NameBDBM515307
Synonyms:6'-(1-cyclopropyl-1H-1,2,4- triazol-5-yl)-2'-{(2R)-2- hydroxy-2-[(3S)-1,2,3,4- tetrahydroisoquinolin-3- yl]ethyl}-2',3'-dihydro-1'H- spiro[cyclobutane-1,4'- isoquinolin]-1'-one | US11098059, Example 11
TypeSmall organic molecule
Emp. Form.C28H31N5O2
Mol. Mass.469.578
SMILESO[C@H](CN1CC2(CCC2)c2cc(ccc2C1=O)-c1ncnn1C1CC1)[C@@H]1Cc2ccccc2CN1