Reaction Details
TargetNociceptin receptor
LigandBDBM303067
Substrate/Competitorn/a
Meas. Tech.In Vitro ORL-1 Receptor Binding Assay
Ki 24.1±1.5 nM
Citation Tadesse, DTafesse, LZhou, X Phosphorus-substituted quinoxaline-type piperidine compounds and uses thereof US Patent US9598447 Publication Date 3/21/2017
 
Nociceptin receptor
Name:Nociceptin receptor
Type:G Protein-Coupled Receptor (GPCR)
Mol. Mass.:40702.87
Organism:Homo sapiens (Human)
Description:P41146
Residue:370
BDBM303067
NameBDBM303067
Synonyms:US9598447, Ref No. MM
TypeSmall organic molecule
Emp. Form.C27H39N4O4P
Mol. Mass.514.5967
SMILESOP(O)(=O)CCNc1nc2ccccc2n([C@@H]2C[C@@H]3CCC[C@H](C2)N3[C@@H]2C[C@H]3CCC[C@H](C3)C2)c1=O