Reaction Details
TargetDelta-type opioid receptor
LigandBDBM303071
Substrate/Competitorn/a
Meas. Tech.In Vitro Delta-Opioid Receptor Binding Assay
Ki 5908±465 nM
Citation Tadesse, DTafesse, LZhou, X Phosphorus-substituted quinoxaline-type piperidine compounds and uses thereof US Patent US9598447 Publication Date 3/21/2017
 
Delta-type opioid receptor
Name:Delta-type opioid receptor
Type:G Protein-Coupled Receptor (GPCR)
Mol. Mass.:40382.98
Organism:Homo sapiens (Human)
Description:Competition binding assays were carried out using membrane preparations from transfected HN9.10 cells that constitutively expressed the delta opioid receptor.
Residue:372
BDBM303071
NameBDBM303071
Synonyms:US9598447, Ref No. TT
TypeSmall organic molecule
Emp. Form.C28H40N3O4P
Mol. Mass.513.6087
SMILESC[C@H]1C[C@H]2C[C@@H](C1)C[C@@H](C2)N1[C@H]2CCC[C@@H]1C[C@@H](C2)n1c2ccccc2nc(CCP(O)(O)=O)c1=O