Reaction Details
TargetNociceptin receptor
LigandBDBM303071
Substrate/Competitorn/a
Meas. Tech.In Vitro ORL-1 Receptor Binding Assay
EC50 3.94±0.87 nM
Citation Tadesse, DTafesse, LZhou, X Phosphorus-substituted quinoxaline-type piperidine compounds and uses thereof US Patent US9598447 Publication Date 3/21/2017
 
Nociceptin receptor
Name:Nociceptin receptor
Type:G Protein-Coupled Receptor (GPCR)
Mol. Mass.:40702.87
Organism:Homo sapiens (Human)
Description:P41146
Residue:370
BDBM303071
NameBDBM303071
Synonyms:US9598447, Ref No. TT
TypeSmall organic molecule
Emp. Form.C28H40N3O4P
Mol. Mass.513.6087
SMILESC[C@H]1C[C@H]2C[C@@H](C1)C[C@@H](C2)N1[C@H]2CCC[C@@H]1C[C@@H](C2)n1c2ccccc2nc(CCP(O)(O)=O)c1=O