Reaction Details
TargetEpidermal growth factor receptor [T790M,L858R]
LigandBDBM50029668
Substrate/Competitorn/a
Meas. Tech.Kinase Inhibition Assay
IC50<1±n/a nM
Citation Wang, YRen, XJin, JLi, HAi, Y Amino pyrimidine compound for inhibiting protein tyrosine kinase activity US Patent US11111233 Publication Date 9/7/2021
 
Epidermal growth factor receptor [T790M,L858R]
Name:Epidermal growth factor receptor [T790M,L858R]
Type:n/a
Mol. Mass.:134353.72
Organism:Homo sapiens (Human)
Description:P00533[T790M,L858R]
Residue:1210
BDBM50029668
NameBDBM50029668
Synonyms:AZD-9291 US10085983, Compound AZD-9291 US11111233, Example AZD9291 US20230322822, Compound AZD9291 WO2022090481, Example osimertinib
TypeSmall organic molecule
Emp. Form.C28H33N7O2
Mol. Mass.499.6073
SMILESCOc1cc(N(C)CCN(C)C)c(NC(=O)C=C)cc1Nc1nccc(n1)-c1cn(C)c2ccccc12