Reaction Details
TargetFibroblast growth factor receptor 3
LigandBDBM50026612
Substrate/Competitorn/a
Meas. Tech.FGFR3 Enzyme Inhibition
Ki 5.90±n/a nM
Citation Walters, IBirch, LCollingwood, SPStevenson, CS Indole derivatives and their use as protein kinase inhibitors US Patent US11208381 Publication Date 12/28/2021
 
Fibroblast growth factor receptor 3
Name:Fibroblast growth factor receptor 3
Type:Protein
Mol. Mass.:87699.57
Organism:Homo sapiens (Human)
Description:P22607
Residue:806
BDBM50026612
NameBDBM50026612
Synonyms:BIBF-1120 US10981896, Compound Nintedanib US11208381, Nintedanib | Vargatef
TypeSmall organic molecule
Emp. Form.C31H33N5O4
Mol. Mass.539.6248
SMILESCOC(=O)c1ccc2\C(=C(\Nc3ccc(cc3)N(C)C(=O)CN3CCN(C)CC3)c3ccccc3)C(=O)Nc2c1