Reaction Details
TargetPlatelet-derived growth factor receptor beta
LigandBDBM531233
Substrate/Competitorn/a
Meas. Tech.PDGFRbeta Enzyme Inhibition
Ki 5.00±n/a nM
Citation Walters, IBirch, LCollingwood, SPStevenson, CS Indole derivatives and their use as protein kinase inhibitors US Patent US11208381 Publication Date 12/28/2021
 
Platelet-derived growth factor receptor beta
Name:Platelet-derived growth factor receptor beta
Type:Enzyme
Mol. Mass.:123922.25
Organism:Homo sapiens (Human)
Description:P09619
Residue:1106
BDBM531233
NameBDBM531233
Synonyms:(Z)-Methyl 3-(((4-(4-(2-((2-hydroxyethyl)amino)-2-oxoethyl)piperazine-1-carbonyl)phenyl)amino)(phenyl)methylene)-5-methyl-2-oxoindoline-6-carboxylate | US11208381, Example 15
TypeSmall organic molecule
Emp. Form.C37H40N4O7
Mol. Mass.652.7361
SMILESCOC(=O)c1cc2N(C(C)=O)C(=O)\C(=C(/Nc3ccc(cc3)C(=O)N3CCN(CC(=O)OC(C)(C)C)CC3)c3ccccc3)c2cc1C