Reaction Details
TargetFibroblast growth factor receptor 3
LigandBDBM445226
Substrate/Competitorn/a
Meas. Tech.FGFR3 Enzyme Inhibition
Ki 5.31±n/a nM
Citation Walters, IBirch, LCollingwood, SPStevenson, CS Indole derivatives and their use as protein kinase inhibitors US Patent US11208381 Publication Date 12/28/2021
 
Fibroblast growth factor receptor 3
Name:Fibroblast growth factor receptor 3
Type:Protein
Mol. Mass.:87699.57
Organism:Homo sapiens (Human)
Description:P22607
Residue:806
BDBM445226
NameBDBM445226
Synonyms:US10669235, Example 17 | US11208381, Example 17
TypeSmall organic molecule
Emp. Form.C30H30N4O4
Mol. Mass.510.5836
SMILESCOC(=O)c1cc2NC(=O)\C(=C(/Nc3ccc(cc3)C(=O)N3CCN(C)CC3)c3ccccc3)c2cc1C