Reaction Details
TargetPlatelet-derived growth factor receptor beta
LigandBDBM445230
Substrate/Competitorn/a
Meas. Tech.PDGFRbeta Enzyme Inhibition
Ki 6.11±n/a nM
Citation Walters, IBirch, LCollingwood, SPStevenson, CS Indole derivatives and their use as protein kinase inhibitors US Patent US11208381 Publication Date 12/28/2021
 
Platelet-derived growth factor receptor beta
Name:Platelet-derived growth factor receptor beta
Type:Enzyme
Mol. Mass.:123922.25
Organism:Homo sapiens (Human)
Description:P09619
Residue:1106
BDBM445230
NameBDBM445230
Synonyms:US10669235, Example 21 | US11208381, Example 21
TypeSmall organic molecule
Emp. Form.C33H37N5O4
Mol. Mass.567.678
SMILESCOC(=O)c1cc2NC(=O)\C(=C(/Nc3ccc(cc3)C(=O)NCCCN3CCN(C)CC3)c3ccccc3)c2cc1C