Reaction Details
TargetPlatelet-derived growth factor receptor beta
LigandBDBM445240
Substrate/Competitorn/a
Meas. Tech.PDGFRbeta Enzyme Inhibition
Ki 4.83±n/a nM
Citation Walters, IBirch, LCollingwood, SPStevenson, CS Indole derivatives and their use as protein kinase inhibitors US Patent US11208381 Publication Date 12/28/2021
 
Platelet-derived growth factor receptor beta
Name:Platelet-derived growth factor receptor beta
Type:Enzyme
Mol. Mass.:123922.25
Organism:Homo sapiens (Human)
Description:P09619
Residue:1106
BDBM445240
NameBDBM445240
Synonyms:US10669235, Example 31 | US11208381, Example 31
TypeSmall organic molecule
Emp. Form.C35H39N5O5
Mol. Mass.609.7147
SMILESCOC(=O)c1cc2NC(=O)\C(=C(/Nc3ccc(cc3)C(=O)N3CCC(CC3)C(=O)NCCN(C)C)c3ccccc3)c2cc1C