Reaction Details
TargetPlatelet-derived growth factor receptor beta
LigandBDBM445247
Substrate/Competitorn/a
Meas. Tech.PDGFRbeta Enzyme Inhibition
Ki 4.79±n/a nM
Citation Walters, IBirch, LCollingwood, SPStevenson, CS Indole derivatives and their use as protein kinase inhibitors US Patent US11208381 Publication Date 12/28/2021
 
Platelet-derived growth factor receptor beta
Name:Platelet-derived growth factor receptor beta
Type:Enzyme
Mol. Mass.:123922.25
Organism:Homo sapiens (Human)
Description:P09619
Residue:1106
BDBM445247
NameBDBM445247
Synonyms:US10669235, Example 38 | US11208381, Example 38
TypeSmall organic molecule
Emp. Form.C34H38N4O5
Mol. Mass.582.6893
SMILESCOC(=O)c1cc2NC(=O)\C(=C(/Nc3ccc(cc3)C(=O)N3CCC(CO)(CN(C)C)CC3)c3ccccc3)c2cc1C